Reaction Details
TargetBeta-2 adrenergic receptor
LigandBDBM50214233
Substrate/Competitorn/a
Meas. Tech.ChEMBL_456298 (CHEMBL888309)
Ki 102±n/a nM
Citation Washburn, WNHarper, TWWu, GGodfrey, JDMcCann, PGirotra, RShao, CZhang, HGavai, AMikkilineni, ADejneka, TAhmed, SCaringal, YHangeland, JZhang, MCheng, PTRussell, ADSkwish, SSlusarchyk, DAAllen, GTFrohlich, BHAbboa-Offei, BECap, MWaldron, TLGeorge, RJTesfamariam, BDickinson, KESeymour, AASher, PM Arylpropanolamines: selective beta3 agonists arising from strategies to mitigate phase I metabolic transformations. Bioorg Med Chem Lett17:4290-6 (2007) 
 
Beta-2 adrenergic receptor
Name:Beta-2 adrenergic receptor
Type:n/a
Mol. Mass.:46461.69
Organism:Homo sapiens (Human)
Description:P07550
Residue:413
BDBM50214233
NameBDBM50214233
Synonyms:CHEMBL250553 | N-(5-((S)-3-((R)-1-(3,4-bis(difluoromethoxy)phenyl)-2-phenylethylamino)-2-hydroxypropyl)-2-hydroxyphenyl)methanesulfonamide
TypeSmall organic molecule
Emp. Form.C26H28F4N2O6S
Mol. Mass.572.569
SMILESCS(=O)(=O)Nc1cc(C[C@H](O)CN[C@H](Cc2ccccc2)c2ccc(OC(F)F)c(OC(F)F)c2)ccc1O