Reaction Details
TargetBeta-3 adrenergic receptor
LigandBDBM50214226
Substrate/Competitorn/a
Meas. Tech.ChEMBL_456291 (CHEMBL888301)
Ki 390±n/a nM
Citation Washburn, WNHarper, TWWu, GGodfrey, JDMcCann, PGirotra, RShao, CZhang, HGavai, AMikkilineni, ADejneka, TAhmed, SCaringal, YHangeland, JZhang, MCheng, PTRussell, ADSkwish, SSlusarchyk, DAAllen, GTFrohlich, BHAbboa-Offei, BECap, MWaldron, TLGeorge, RJTesfamariam, BDickinson, KESeymour, AASher, PM Arylpropanolamines: selective beta3 agonists arising from strategies to mitigate phase I metabolic transformations. Bioorg Med Chem Lett17:4290-6 (2007) 
 
Beta-3 adrenergic receptor
Name:Beta-3 adrenergic receptor
Type:G Protein-Coupled Receptor (GPCR)
Mol. Mass.:43534.88
Organism:Homo sapiens (Human)
Description:n/a
Residue:408
BDBM50214226
NameBDBM50214226
Synonyms:CHEMBL251554 | N-(2-hydroxy-5-((R)-2-hydroxy-3-((S)-1-(3-methoxyphenyl)-3-phenylpropylamino)propyl)phenyl)methanesulfonamide
TypeSmall organic molecule
Emp. Form.C26H32N2O5S
Mol. Mass.484.608
SMILESCOc1cccc(c1)[C@H](CCc1ccccc1)NC[C@H](O)Cc1ccc(O)c(NS(C)(=O)=O)c1