Reaction Details
TargetBeta-3 adrenergic receptor
LigandBDBM50214240
Substrate/Competitorn/a
Meas. Tech.ChEMBL_456291 (CHEMBL888301)
Ki 7±n/a nM
Citation Washburn, WNHarper, TWWu, GGodfrey, JDMcCann, PGirotra, RShao, CZhang, HGavai, AMikkilineni, ADejneka, TAhmed, SCaringal, YHangeland, JZhang, MCheng, PTRussell, ADSkwish, SSlusarchyk, DAAllen, GTFrohlich, BHAbboa-Offei, BECap, MWaldron, TLGeorge, RJTesfamariam, BDickinson, KESeymour, AASher, PM Arylpropanolamines: selective beta3 agonists arising from strategies to mitigate phase I metabolic transformations. Bioorg Med Chem Lett17:4290-6 (2007) 
 
Beta-3 adrenergic receptor
Name:Beta-3 adrenergic receptor
Type:G Protein-Coupled Receptor (GPCR)
Mol. Mass.:43534.88
Organism:Homo sapiens (Human)
Description:n/a
Residue:408
BDBM50214240
NameBDBM50214240
Synonyms:(R)-N-(2-hydroxy-5-(1-hydroxy-2-(2-(4-methoxyphenyl)propan-2-ylamino)ethyl)phenyl)methanesulfonamide | CHEMBL250191
TypeSmall organic molecule
Emp. Form.C19H26N2O5S
Mol. Mass.394.485
SMILESCOc1ccc(cc1)C(C)(C)NC[C@H](O)c1ccc(O)c(NS(C)(=O)=O)c1