Reaction Details
TargetBeta-1 adrenergic receptor
LigandBDBM50214225
Substrate/Competitorn/a
Meas. Tech.ChEMBL_456293 (CHEMBL888304)
Ki 560±n/a nM
Citation Washburn, WNHarper, TWWu, GGodfrey, JDMcCann, PGirotra, RShao, CZhang, HGavai, AMikkilineni, ADejneka, TAhmed, SCaringal, YHangeland, JZhang, MCheng, PTRussell, ADSkwish, SSlusarchyk, DAAllen, GTFrohlich, BHAbboa-Offei, BECap, MWaldron, TLGeorge, RJTesfamariam, BDickinson, KESeymour, AASher, PM Arylpropanolamines: selective beta3 agonists arising from strategies to mitigate phase I metabolic transformations. Bioorg Med Chem Lett17:4290-6 (2007) 
 
Beta-1 adrenergic receptor
Name:Beta-1 adrenergic receptor
Type:G Protein-Coupled Receptor (GPCR)
Mol. Mass.:51338.40
Organism:Homo sapiens (Human)
Description:P08588
Residue:477
BDBM50214225
NameBDBM50214225
Synonyms:CHEMBL398557 | N-(5-((S)-3-((S)-1-(3,4-dimethoxyphenyl)-2-phenylethylamino)-2-hydroxypropyl)-2-hydroxyphenyl)methanesulfonamide
TypeSmall organic molecule
Emp. Form.C26H32N2O6S
Mol. Mass.500.607
SMILESCOc1ccc(cc1OC)[C@H](Cc1ccccc1)NC[C@@H](O)Cc1ccc(O)c(NS(C)(=O)=O)c1