Reaction Details
TargetBeta-3 adrenergic receptor
LigandBDBM50214220
Substrate/Competitorn/a
Meas. Tech.ChEMBL_456291 (CHEMBL888301)
Ki 59±n/a nM
Citation Washburn, WNHarper, TWWu, GGodfrey, JDMcCann, PGirotra, RShao, CZhang, HGavai, AMikkilineni, ADejneka, TAhmed, SCaringal, YHangeland, JZhang, MCheng, PTRussell, ADSkwish, SSlusarchyk, DAAllen, GTFrohlich, BHAbboa-Offei, BECap, MWaldron, TLGeorge, RJTesfamariam, BDickinson, KESeymour, AASher, PM Arylpropanolamines: selective beta3 agonists arising from strategies to mitigate phase I metabolic transformations. Bioorg Med Chem Lett17:4290-6 (2007) 
 
Beta-3 adrenergic receptor
Name:Beta-3 adrenergic receptor
Type:G Protein-Coupled Receptor (GPCR)
Mol. Mass.:43534.88
Organism:Homo sapiens (Human)
Description:n/a
Residue:408
BDBM50214220
NameBDBM50214220
Synonyms:CHEMBL251555 | N-(5-((R)-3-((S)-1-(3,4-bis(difluoromethoxy)phenyl)-3-phenylpropylamino)-2-hydroxypropyl)-2-hydroxyphenyl)methanesulfonamide
TypeSmall organic molecule
Emp. Form.C27H30F4N2O6S
Mol. Mass.586.596
SMILESCS(=O)(=O)Nc1cc(C[C@@H](O)CN[C@@H](CCc2ccccc2)c2ccc(OC(F)F)c(OC(F)F)c2)ccc1O