Reaction Details
TargetBeta-3 adrenergic receptor
LigandBDBM50214224
Substrate/Competitorn/a
Meas. Tech.ChEMBL_456291 (CHEMBL888301)
Ki 29±n/a nM
Citation Washburn, WNHarper, TWWu, GGodfrey, JDMcCann, PGirotra, RShao, CZhang, HGavai, AMikkilineni, ADejneka, TAhmed, SCaringal, YHangeland, JZhang, MCheng, PTRussell, ADSkwish, SSlusarchyk, DAAllen, GTFrohlich, BHAbboa-Offei, BECap, MWaldron, TLGeorge, RJTesfamariam, BDickinson, KESeymour, AASher, PM Arylpropanolamines: selective beta3 agonists arising from strategies to mitigate phase I metabolic transformations. Bioorg Med Chem Lett17:4290-6 (2007) 
 
Beta-3 adrenergic receptor
Name:Beta-3 adrenergic receptor
Type:G Protein-Coupled Receptor (GPCR)
Mol. Mass.:43534.88
Organism:Homo sapiens (Human)
Description:n/a
Residue:408
BDBM50214224
NameBDBM50214224
Synonyms:CHEMBL398241 | N-(5-((R)-3-((S)-3-(3-chlorophenyl)-1-(3,4-dimethoxyphenyl)propylamino)-2-hydroxypropyl)-2-hydroxyphenyl)methanesulfonamide
TypeSmall organic molecule
Emp. Form.C27H33ClN2O6S
Mol. Mass.549.079
SMILESCOc1ccc(cc1OC)[C@H](CCc1cccc(Cl)c1)NC[C@H](O)Cc1ccc(O)c(NS(C)(=O)=O)c1