Reaction Details
TargetBeta-3 adrenergic receptor
LigandBDBM50214247
Substrate/Competitorn/a
Meas. Tech.ChEMBL_456291 (CHEMBL888301)
Ki 340±n/a nM
Citation Washburn, WNHarper, TWWu, GGodfrey, JDMcCann, PGirotra, RShao, CZhang, HGavai, AMikkilineni, ADejneka, TAhmed, SCaringal, YHangeland, JZhang, MCheng, PTRussell, ADSkwish, SSlusarchyk, DAAllen, GTFrohlich, BHAbboa-Offei, BECap, MWaldron, TLGeorge, RJTesfamariam, BDickinson, KESeymour, AASher, PM Arylpropanolamines: selective beta3 agonists arising from strategies to mitigate phase I metabolic transformations. Bioorg Med Chem Lett17:4290-6 (2007) 
 
Beta-3 adrenergic receptor
Name:Beta-3 adrenergic receptor
Type:G Protein-Coupled Receptor (GPCR)
Mol. Mass.:43534.88
Organism:Homo sapiens (Human)
Description:n/a
Residue:408
BDBM50214247
NameBDBM50214247
Synonyms:(S)-N-(5-(3-(bis(4-(difluoromethoxy)phenyl)methylamino)-2-hydroxypropyl)-2-hydroxyphenyl)methanesulfonamide | CHEMBL399867
TypeSmall organic molecule
Emp. Form.C25H26F4N2O6S
Mol. Mass.558.542
SMILESCS(=O)(=O)Nc1cc(C[C@H](O)CNC(c2ccc(OC(F)F)cc2)c2ccc(OC(F)F)cc2)ccc1O