Reaction Details
TargetMotilin receptor
LigandBDBM50199378
Substrate/Competitorn/a
Meas. Tech.ChEMBL_447562 (CHEMBL896576)
Ki 664±n/a nM
Citation Marsault, EBenakli, KBeaubien, SSaint-Louis, CDéziel, RFraser, G Potent macrocyclic antagonists to the motilin receptor presenting novel unnatural amino acids. Bioorg Med Chem Lett17:4187-90 (2007) 
 
Motilin receptor
Name:Motilin receptor
Type:PROTEIN
Mol. Mass.:45365.95
Organism:Homo sapiens (Human)
Description:ChEMBL_122664
Residue:412
BDBM50199378
NameBDBM50199378
Synonyms:(9R,12R,15S)-15-(4-amino-butyl)-9-(4-hydroxy-benzyl)-12-isopropyl-6,7,8,9,11,12,14,15,17,18-decahydro-5-oxa-8,11,14,17-tetraaza-benzocyclooctadecene-10,13,16-trione | CHEMBL214508
TypeSmall organic molecule
Emp. Form.C31H43N5O5
Mol. Mass.565.7036
SMILESCC(C)[C@H]1NC(=O)[C@@H](Cc2ccc(O)cc2)NCCOc2ccccc2\C=C\CNC(=O)[C@H](CCCCN)NC1=O