Reaction Details
TargetPolyamine deacetylase HDAC10
LigandBDBM50214431
Substrate/Competitorn/a
Meas. Tech.ChEMBL_439076 (CHEMBL889424)
IC50 178±n/a nM
Citation Kozikowski, APChen, YGaysin, AChen, BD'Annibale, MASuto, CMLangley, BC Functional differences in epigenetic modulators-superiority of mercaptoacetamide-based histone deacetylase inhibitors relative to hydroxamates in cortical neuron neuroprotection studies. J Med Chem50:3054-61 (2007) 
 
Polyamine deacetylase HDAC10
Name:Polyamine deacetylase HDAC10
Type:Chromatin regulator; hydrolase; repressor
Mol. Mass.:71431.89
Organism:Homo sapiens (Human)
Description:Q969S8
Residue:669
BDBM50214431
NameBDBM50214431
Synonyms:8-[3-(4-dimethylaminobenzyl)ureido]octanoic acid hydroxyamide | CHEMBL227119
TypeSmall organic molecule
Emp. Form.C13H20N4O3
Mol. Mass.280.3229
SMILESCN(C)c1ccc(CNC(=O)NCCC(=O)NO)cc1