Reaction Details
TargetHistone deacetylase 1
LigandBDBM50214431
Substrate/Competitorn/a
Meas. Tech.ChEMBL_439073 (CHEMBL889421)
IC50 130±n/a nM
Citation Kozikowski, APChen, YGaysin, AChen, BD'Annibale, MASuto, CMLangley, BC Functional differences in epigenetic modulators-superiority of mercaptoacetamide-based histone deacetylase inhibitors relative to hydroxamates in cortical neuron neuroprotection studies. J Med Chem50:3054-61 (2007) 
 
Histone deacetylase 1
Name:Histone deacetylase 1
Type:Enzyme
Mol. Mass.:55090.27
Organism:Homo sapiens (Human)
Description:Q13547
Residue:482
BDBM50214431
NameBDBM50214431
Synonyms:8-[3-(4-dimethylaminobenzyl)ureido]octanoic acid hydroxyamide | CHEMBL227119
TypeSmall organic molecule
Emp. Form.C13H20N4O3
Mol. Mass.280.3229
SMILESCN(C)c1ccc(CNC(=O)NCCC(=O)NO)cc1