Reaction Details
TargetHistone deacetylase 2
LigandBDBM50214432
Substrate/Competitorn/a
Meas. Tech.ChEMBL_439074 (CHEMBL889422)
IC50 113±n/a nM
Citation Kozikowski, APChen, YGaysin, AChen, BD'Annibale, MASuto, CMLangley, BC Functional differences in epigenetic modulators-superiority of mercaptoacetamide-based histone deacetylase inhibitors relative to hydroxamates in cortical neuron neuroprotection studies. J Med Chem50:3054-61 (2007) 
 
Histone deacetylase 2
Name:Histone deacetylase 2
Type:Chromatin regulator; hydrolase; repressor
Mol. Mass.:55356.54
Organism:Homo sapiens (Human)
Description:Q92769
Residue:488
BDBM50214432
NameBDBM50214432
Synonyms:CHEMBL387924 | octanedioic acid hydroxyamide [4-(3-nitro-phenyl)thiazol-2-yl]amide
TypeSmall organic molecule
Emp. Form.C17H20N4O5S
Mol. Mass.392.429
SMILESONC(=O)CCCCCCC(=O)Nc1nc(cs1)-c1cccc(c1)[N+]([O-])=O