Reaction Details
TargetHistone deacetylase 6
LigandBDBM50161470
Substrate/Competitorn/a
Meas. Tech.ChEMBL_439077 (CHEMBL889425)
IC50 95.3±n/a nM
Citation Kozikowski, APChen, YGaysin, AChen, BD'Annibale, MASuto, CMLangley, BC Functional differences in epigenetic modulators-superiority of mercaptoacetamide-based histone deacetylase inhibitors relative to hydroxamates in cortical neuron neuroprotection studies. J Med Chem50:3054-61 (2007) 
 
Histone deacetylase 6
Name:Histone deacetylase 6
Type:Chromatin regulator; hydrolase; repressor
Mol. Mass.:131381.51
Organism:Homo sapiens (Human)
Description:Q9UBN7
Residue:1215
BDBM50161470
NameBDBM50161470
Synonyms:6-(2-Mercapto-acetylamino)-hexanoic acid quinolin-8-ylamide 6-(2-mercaptoacetylamino)-hexanoic acid quinolin-8-ylamide | CHEMBL178456
TypeSmall organic molecule
Emp. Form.C17H21N3O2S
Mol. Mass.331.433
SMILESSCC(=O)NCCCCCC(=O)Nc1cccc2cccnc12