Reaction Details
TargetHistone deacetylase 1
LigandBDBM50214436
Substrate/Competitorn/a
Meas. Tech.ChEMBL_439073 (CHEMBL889421)
IC50 26.7±n/a nM
Citation Kozikowski, APChen, YGaysin, AChen, BD'Annibale, MASuto, CMLangley, BC Functional differences in epigenetic modulators-superiority of mercaptoacetamide-based histone deacetylase inhibitors relative to hydroxamates in cortical neuron neuroprotection studies. J Med Chem50:3054-61 (2007) 
 
Histone deacetylase 1
Name:Histone deacetylase 1
Type:Enzyme
Mol. Mass.:55090.27
Organism:Homo sapiens (Human)
Description:Q13547
Residue:482
BDBM50214436
NameBDBM50214436
Synonyms:CHEMBL389688 | octanedioic acid {2'-[2-amino-3-(1H-indol-3-yl)propionylamino]biphenyl-4-yl}amide hydroxyamide
TypeSmall organic molecule
Emp. Form.C31H35N5O4
Mol. Mass.541.6407
SMILESN[C@@H](Cc1c[nH]c2ccccc12)C(=O)Nc1ccccc1-c1ccc(NC(=O)CCCCCCC(=O)NO)cc1