Reaction Details
TargetHistone deacetylase 2
LigandBDBM50214441
Substrate/Competitorn/a
Meas. Tech.ChEMBL_439074 (CHEMBL889422)
IC50 156±n/a nM
Citation Kozikowski, APChen, YGaysin, AChen, BD'Annibale, MASuto, CMLangley, BC Functional differences in epigenetic modulators-superiority of mercaptoacetamide-based histone deacetylase inhibitors relative to hydroxamates in cortical neuron neuroprotection studies. J Med Chem50:3054-61 (2007) 
 
Histone deacetylase 2
Name:Histone deacetylase 2
Type:Chromatin regulator; hydrolase; repressor
Mol. Mass.:55356.54
Organism:Homo sapiens (Human)
Description:Q92769
Residue:488
BDBM50214441
NameBDBM50214441
Synonyms:CHEMBL389687 | octanedioic acid [2'-(2-amino-3-phenylpropionylamino)-biphenyl-4-yl]amide hydroxyamide
TypeSmall organic molecule
Emp. Form.C29H34N4O4
Mol. Mass.502.6047
SMILESN[C@@H](Cc1ccccc1)C(=O)Nc1ccccc1-c1ccc(NC(=O)CCCCCCC(=O)NO)cc1