Reaction Details
TargetCasein kinase II subunit alpha
LigandBDBM50214444
Substrate/Competitorn/a
Meas. Tech.ChEMBL_439082 (CHEMBL889430)
Ki 5±n/a nM
Citation Nie, ZPerretta, CErickson, PMargosiak, SAlmassy, RLu, JAverill, AYager, KMChu, S Structure-based design, synthesis, and study of pyrazolo[1,5-a][1,3,5]triazine derivatives as potent inhibitors of protein kinase CK2. Bioorg Med Chem Lett17:4191-5 (2007) 
 
Casein kinase II subunit alpha
Name:Casein kinase II subunit alpha
Type:Enzyme
Mol. Mass.:45151.12
Organism:Homo sapiens (Human)
Description:P68400
Residue:391
BDBM50214444
NameBDBM50214444
Synonyms:2-(p-toluidino)-4-(phenylamino)pyrazolo[1,5-a][1,3,5]triazine-8-carbonitrile | CHEMBL231492
TypeSmall organic molecule
Emp. Form.C19H15N7
Mol. Mass.341.3693
SMILESCc1ccc(Nc2nc(Nc3ccccc3)n3ncc(C#N)c3n2)cc1