Reaction Details
TargetCasein kinase II subunit alpha
LigandBDBM50214448
Substrate/Competitorn/a
Meas. Tech.ChEMBL_439082 (CHEMBL889430)
Ki 9±n/a nM
Citation Nie, ZPerretta, CErickson, PMargosiak, SAlmassy, RLu, JAverill, AYager, KMChu, S Structure-based design, synthesis, and study of pyrazolo[1,5-a][1,3,5]triazine derivatives as potent inhibitors of protein kinase CK2. Bioorg Med Chem Lett17:4191-5 (2007) 
 
Casein kinase II subunit alpha
Name:Casein kinase II subunit alpha
Type:Enzyme
Mol. Mass.:45151.12
Organism:Homo sapiens (Human)
Description:P68400
Residue:391
BDBM50214448
NameBDBM50214448
Synonyms:2-(3,4-dimethoxyphenylamino)-4-(phenylamino)pyrazolo[1,5-a][1,3,5]triazine-8-carbonitrile | CHEMBL231590
TypeSmall organic molecule
Emp. Form.C20H17N7O2
Mol. Mass.387.3947
SMILESCOc1ccc(Nc2nc(Nc3ccccc3)n3ncc(C#N)c3n2)cc1OC