Reaction Details
TargetCasein kinase II subunit alpha
LigandBDBM50214453
Substrate/Competitorn/a
Meas. Tech.ChEMBL_439082 (CHEMBL889430)
Ki 13±n/a nM
Citation Nie, ZPerretta, CErickson, PMargosiak, SAlmassy, RLu, JAverill, AYager, KMChu, S Structure-based design, synthesis, and study of pyrazolo[1,5-a][1,3,5]triazine derivatives as potent inhibitors of protein kinase CK2. Bioorg Med Chem Lett17:4191-5 (2007) 
 
Casein kinase II subunit alpha
Name:Casein kinase II subunit alpha
Type:Enzyme
Mol. Mass.:45151.12
Organism:Homo sapiens (Human)
Description:P68400
Residue:391
BDBM50214453
NameBDBM50214453
Synonyms:2-(isopentylamino)-4-(phenylamino)pyrazolo[1,5-a][1,3,5]triazine-8-carbonitrile | CHEMBL389765
TypeSmall organic molecule
Emp. Form.C17H19N7
Mol. Mass.321.3797
SMILESCC(C)CCNc1nc(Nc2ccccc2)n2ncc(C#N)c2n1