Reaction Details
TargetCasein kinase II subunit alpha
LigandBDBM50214473
Substrate/Competitorn/a
Meas. Tech.ChEMBL_439082 (CHEMBL889430)
Ki 0.35±n/a nM
Citation Nie, ZPerretta, CErickson, PMargosiak, SAlmassy, RLu, JAverill, AYager, KMChu, S Structure-based design, synthesis, and study of pyrazolo[1,5-a][1,3,5]triazine derivatives as potent inhibitors of protein kinase CK2. Bioorg Med Chem Lett17:4191-5 (2007) 
 
Casein kinase II subunit alpha
Name:Casein kinase II subunit alpha
Type:Enzyme
Mol. Mass.:45151.12
Organism:Homo sapiens (Human)
Description:P68400
Residue:391
BDBM50214473
NameBDBM50214473
Synonyms:CHEMBL230354 | N-(3-(8-CYANO-4-(PHENYLAMINO)PYRAZOLO[1,5-A][1,3,5]TRIAZIN-2-YLAMINO)PHENYL)ACETAMIDE
TypeSmall organic molecule
Emp. Form.C20H16N8O
Mol. Mass.384.394
SMILESCC(=O)Nc1cccc(Nc2nc(Nc3ccccc3)n3ncc(C#N)c3n2)c1