Reaction Details
TargetCasein kinase II subunit alpha
LigandBDBM50214478
Substrate/Competitorn/a
Meas. Tech.ChEMBL_439082 (CHEMBL889430)
Ki 55±n/a nM
Citation Nie, ZPerretta, CErickson, PMargosiak, SAlmassy, RLu, JAverill, AYager, KMChu, S Structure-based design, synthesis, and study of pyrazolo[1,5-a][1,3,5]triazine derivatives as potent inhibitors of protein kinase CK2. Bioorg Med Chem Lett17:4191-5 (2007) 
 
Casein kinase II subunit alpha
Name:Casein kinase II subunit alpha
Type:Enzyme
Mol. Mass.:45151.12
Organism:Homo sapiens (Human)
Description:P68400
Residue:391
BDBM50214478
NameBDBM50214478
Synonyms:2-(benzyl(methyl)amino)-4-(phenylamino)pyrazolo[1,5-a][1,3,5]triazine-8-carbonitrile | CHEMBL230455
TypeSmall organic molecule
Emp. Form.C20H17N7
Mol. Mass.355.3959
SMILESCN(Cc1ccccc1)c1nc(Nc2ccccc2)n2ncc(C#N)c2n1