Reaction Details
TargetMelanocortin receptor 4
LigandBDBM50214679
Substrate/Competitorn/a
Meas. Tech.ChEMBL_448087 (CHEMBL898343)
Ki 2.5±n/a nM
Citation Tran, JATucci, FCJiang, WMarinkovic, DChen, CWArellano, MMarkison, SFleck, BAWen, JWhite, NSPontillo, JSaunders, JMarks, DHoare, SRMadan, AFoster, ACChen, C Pyrrolidinones as orally bioavailable antagonists of the human melanocortin-4 receptor with anti-cachectic activity. Bioorg Med Chem15:5166-76 (2007) 
 
Melanocortin receptor 4
Name:Melanocortin receptor 4
Type:Enzyme
Mol. Mass.:36949.50
Organism:Homo sapiens (Human)
Description:P32245
Residue:332
BDBM50214679
NameBDBM50214679
Synonyms:1-{4-[(1S)-2-(amino-3-methylbutyl)-6-trifluoromethylphenyl]-4-[(2R)-(3-aminopropionylamido)-3-(2,4-dichlorophenyl)propionyl]}-piperazine | CHEMBL237050
TypeSmall organic molecule
Emp. Form.C28H36Cl2F3N5O2
Mol. Mass.602.519
SMILESCC(C)C[C@H](N)c1cccc(c1N1CCN(CC1)C(=O)[C@@H](Cc1ccc(Cl)cc1Cl)NC(=O)CCN)C(F)(F)F