Reaction Details
TargetMelanocortin receptor 5
LigandBDBM50214688
Substrate/Competitorn/a
Meas. Tech.ChEMBL_448090 (CHEMBL898346)
Ki 240±n/a nM
Citation Tran, JATucci, FCJiang, WMarinkovic, DChen, CWArellano, MMarkison, SFleck, BAWen, JWhite, NSPontillo, JSaunders, JMarks, DHoare, SRMadan, AFoster, ACChen, C Pyrrolidinones as orally bioavailable antagonists of the human melanocortin-4 receptor with anti-cachectic activity. Bioorg Med Chem15:5166-76 (2007) 
 
Melanocortin receptor 5
Name:Melanocortin receptor 5
Type:Enzyme
Mol. Mass.:36612.92
Organism:Homo sapiens (Human)
Description:P33032
Residue:325
BDBM50214688
NameBDBM50214688
Synonyms:1-{4-[(1R)-2-(amino-3-methylbutyl)-6-fluorophenyl]-4-[(2R)-(3-aminopropionylamido)-3-(2,4-dichlorophenyl)propionyl]}-piperazine | CHEMBL236014
TypeSmall organic molecule
Emp. Form.C27H36Cl2FN5O2
Mol. Mass.552.511
SMILESCC(C)C[C@H](N)c1cccc(F)c1N1CCN(CC1)C(=O)[C@@H](Cc1ccc(Cl)cc1Cl)NC(=O)CCN