Reaction Details
TargetMu-type opioid receptor
LigandBDBM50214842
Substrate/Competitorn/a
Meas. Tech.ChEMBL_437129 (CHEMBL906526)
Ki>10000±n/a nM
Citation Vergelli, CGiovannoni, MPPieretti, SDi Giannuario, ADal Piaz, VBiagini, PBiancalani, CGraziano, ACesari, N 4-Amino-5-vinyl-3(2H)-pyridazinones and analogues as potent antinociceptive agents: Synthesis, SARs, and preliminary studies on the mechanism of action. Bioorg Med Chem15:5563-75 (2007) 
 
Mu-type opioid receptor
Name:Mu-type opioid receptor
Type:G Protein-Coupled Receptor (GPCR)
Mol. Mass.:44789.51
Organism:Homo sapiens (Human)
Description:P35372
Residue:400
BDBM50214842
NameBDBM50214842
Synonyms:4-amino-2-butyl-6-phenyl-5-vinylpyridazin-3(2H)-one | CHEMBL227079
TypeSmall organic molecule
Emp. Form.C16H19N3O
Mol. Mass.269.3416
SMILESCCCCn1nc(-c2ccccc2)c(C=C)c(N)c1=O