Reaction Details
TargetAdenosine receptor A3
LigandBDBM50214977
Substrate/Competitorn/a
Meas. Tech.ChEMBL_439361 (CHEMBL888475)
Ki 12.7±n/a nM
Citation Jeong, LSChoe, SAGunaga, PKim, HOLee, HWLee, SKTosh, DKPatel, APalaniappan, KKGao, ZGJacobson, KAMoon, HR Discovery of a new nucleoside template for human A3 adenosine receptor ligands: D-4'-thioadenosine derivatives without 4'-hydroxymethyl group as highly potent and selective antagonists. J Med Chem50:3159-62 (2007) 
 
Adenosine receptor A3
Name:Adenosine receptor A3
Type:G Protein-Coupled Receptor (GPCR)
Mol. Mass.:36197.32
Organism:Homo sapiens (Human)
Description:P0DMS8
Residue:318
BDBM50214977
NameBDBM50214977
Synonyms:(2R,3R,4S)-2-(2-chloro-6-(5-chloro-2-methoxybenzylamino)-9H-purin-9-yl)tetrahydrothiophene-3,4-diol | CHEMBL437923
TypeSmall organic molecule
Emp. Form.C17H17Cl2N5O3S
Mol. Mass.442.32
SMILESCOc1ccc(Cl)cc1CNc1nc(Cl)nc2n(cnc12)[C@@H]1SC[C@@H](O)[C@H]1O