Reaction Details
TargetAdenosine receptor A3
LigandBDBM50177307
Substrate/Competitorn/a
Meas. Tech.ChEMBL_439361 (CHEMBL888475)
Ki 29±n/a nM
Citation Jeong, LSChoe, SAGunaga, PKim, HOLee, HWLee, SKTosh, DKPatel, APalaniappan, KKGao, ZGJacobson, KAMoon, HR Discovery of a new nucleoside template for human A3 adenosine receptor ligands: D-4'-thioadenosine derivatives without 4'-hydroxymethyl group as highly potent and selective antagonists. J Med Chem50:3159-62 (2007) 
 
Adenosine receptor A3
Name:Adenosine receptor A3
Type:G Protein-Coupled Receptor (GPCR)
Mol. Mass.:36197.32
Organism:Homo sapiens (Human)
Description:P0DMS8
Residue:318
BDBM50177307
NameBDBM50177307
Synonyms:(2S,3S,4R,5R)-5-(6-(3-iodobenzylamino)-2-chloro-9H-purin-9-yl)-3,4-dihydroxy-N,N-dimethyl-tetrahydrofuran-2-carboxamide CHEMBL373065
TypeSmall organic molecule
Emp. Form.C19H20ClIN6O4
Mol. Mass.558.757
SMILESCN(C)C(=O)[C@H]1O[C@H]([C@H](O)[C@@H]1O)n1cnc2c(NCc3cccc(I)c3)nc(Cl)nc12