Reaction Details
TargetEstrogen receptor
LigandBDBM50215048
Substrate/Competitorn/a
Meas. Tech.ChEMBL_447657 (CHEMBL896664)
Ki 38000±n/a nM
Citation Zhou, HBCollins, MLGunther, JRComninos, JSKatzenellenbogen, JA Bicyclo[2.2.2]octanes: close structural mimics of the nuclear receptor-binding motif of steroid receptor coactivators. Bioorg Med Chem Lett17:4118-22 (2007) 
 
Estrogen receptor
Name:Estrogen receptor
Type:Protein
Mol. Mass.:66230.44
Organism:Homo sapiens (Human)
Description:P03372
Residue:595
BDBM50215048
NameBDBM50215048
Synonyms:CHEMBL236496 | methyl 2-(benzyloxycarbonyl)-3-(2-methyl-5-(2-methyl-4-(4-methylpentanamido)butan-2-yl)bicyclo[2.2.2]octan-2-yl)propanoate
TypeSmall organic molecule
Emp. Form.C32H50N2O5
Mol. Mass.542.7498
SMILESCOC(=O)C(CC1(C)CC2CCC1CC2C(C)(C)CCNC(=O)CCC(C)C)NC(=O)OCc1ccccc1