Reaction Details
TargetGonadotropin-releasing hormone receptor
LigandBDBM50215168
Substrate/Competitorn/a
Meas. Tech.ChEMBL_448200 (CHEMBL898460)
Ki 10±n/a nM
Citation Lanier, MCFeher, MAshweek, NJLoweth, CJRueter, JKSlee, DHWilliams, JPZhu, YFSullivan, SKBrown, MS Selection, synthesis, and structure-activity relationship of tetrahydropyrido[4,3-d]pyrimidine-2,4-diones as human GnRH receptor antagonists. Bioorg Med Chem15:5590-603 (2007) 
 
Gonadotropin-releasing hormone receptor
Name:Gonadotropin-releasing hormone receptor
Type:Enzyme
Mol. Mass.:37749.45
Organism:Homo sapiens (Human)
Description:P30968
Residue:328
BDBM50215168
NameBDBM50215168
Synonyms:1-(2-fluoro-6-(trifluoromethyl)benzyl)-3-(2-(methyl(2-(pyridin-2-yl)ethyl)amino)ethyl)-6-((3-methylbenzo[b]thiophen-2-yl)methyl)-5,6,7,8-tetrahydropyrido[4,3-d]pyrimidine-2,4(1H,3H)-dione | CHEMBL413238
TypeSmall organic molecule
Emp. Form.C35H35F4N5O2S
Mol. Mass.665.743
SMILESCN(CCc1ccccn1)CCn1c(=O)c2CN(Cc3sc4ccccc4c3C)CCc2n(Cc2c(F)cccc2C(F)(F)F)c1=O