Reaction Details
TargetGonadotropin-releasing hormone receptor
LigandBDBM50215170
Substrate/Competitorn/a
Meas. Tech.ChEMBL_448200 (CHEMBL898460)
Ki 305±n/a nM
Citation Lanier, MCFeher, MAshweek, NJLoweth, CJRueter, JKSlee, DHWilliams, JPZhu, YFSullivan, SKBrown, MS Selection, synthesis, and structure-activity relationship of tetrahydropyrido[4,3-d]pyrimidine-2,4-diones as human GnRH receptor antagonists. Bioorg Med Chem15:5590-603 (2007) 
 
Gonadotropin-releasing hormone receptor
Name:Gonadotropin-releasing hormone receptor
Type:Enzyme
Mol. Mass.:37749.45
Organism:Homo sapiens (Human)
Description:P30968
Residue:328
BDBM50215170
NameBDBM50215170
Synonyms:1-benzyl-3-(2-(methyl(2-(pyridin-2-yl)ethyl)amino)ethyl)-6-((3-methylbenzo[b]thiophen-2-yl)methyl)-5,6,7,8-tetrahydropyrido[4,3-d]pyrimidine-2,4(1H,3H)-dione | CHEMBL392607
TypeSmall organic molecule
Emp. Form.C34H37N5O2S
Mol. Mass.579.755
SMILESCN(CCc1ccccn1)CCn1c(=O)c2CN(Cc3sc4ccccc4c3C)CCc2n(Cc2ccccc2)c1=O