Reaction Details
TargetGonadotropin-releasing hormone receptor
LigandBDBM50215180
Substrate/Competitorn/a
Meas. Tech.ChEMBL_448200 (CHEMBL898460)
Ki 515±n/a nM
Citation Lanier, MCFeher, MAshweek, NJLoweth, CJRueter, JKSlee, DHWilliams, JPZhu, YFSullivan, SKBrown, MS Selection, synthesis, and structure-activity relationship of tetrahydropyrido[4,3-d]pyrimidine-2,4-diones as human GnRH receptor antagonists. Bioorg Med Chem15:5590-603 (2007) 
 
Gonadotropin-releasing hormone receptor
Name:Gonadotropin-releasing hormone receptor
Type:Enzyme
Mol. Mass.:37749.45
Organism:Homo sapiens (Human)
Description:P30968
Residue:328
BDBM50215180
NameBDBM50215180
Synonyms:6-(2-(1H-indol-3-yl)ethyl)-1-(2,6-difluorobenzyl)-3-(2-(methyl(2-(pyridin-2-yl)ethyl)amino)ethyl)-5,6,7,8-tetrahydropyrido[4,3-d]pyrimidine-2,4(1H,3H)-dione | CHEMBL236546
TypeSmall organic molecule
Emp. Form.C34H36F2N6O2
Mol. Mass.598.6854
SMILESCN(CCc1ccccn1)CCn1c(=O)c2CN(CCc3c[nH]c4ccccc34)CCc2n(Cc2c(F)cccc2F)c1=O