Reaction Details
TargetGonadotropin-releasing hormone receptor
LigandBDBM50215184
Substrate/Competitorn/a
Meas. Tech.ChEMBL_448200 (CHEMBL898460)
Ki 10±n/a nM
Citation Lanier, MCFeher, MAshweek, NJLoweth, CJRueter, JKSlee, DHWilliams, JPZhu, YFSullivan, SKBrown, MS Selection, synthesis, and structure-activity relationship of tetrahydropyrido[4,3-d]pyrimidine-2,4-diones as human GnRH receptor antagonists. Bioorg Med Chem15:5590-603 (2007) 
 
Gonadotropin-releasing hormone receptor
Name:Gonadotropin-releasing hormone receptor
Type:Enzyme
Mol. Mass.:37749.45
Organism:Homo sapiens (Human)
Description:P30968
Residue:328
BDBM50215184
NameBDBM50215184
Synonyms:(R)-1-(2,6-difluorobenzyl)-6-(4-chlorobenzyl)-3-((1-(2-(pyridin-2-yl)ethyl)pyrrolidin-2-yl)methyl)-5,6,7,8-tetrahydropyrido[4,3-d]pyrimidine-2,4(1H,3H)-dione | CHEMBL236152
TypeSmall organic molecule
Emp. Form.C33H34ClF2N5O2
Mol. Mass.606.105
SMILESFc1cccc(F)c1Cn1c2CCN(Cc3ccc(Cl)cc3)Cc2c(=O)n(C[C@H]2CCCN2CCc2ccccn2)c1=O