Reaction Details
TargetGlutamate receptor ionotropic, NMDA 1
LigandBDBM50215285
Substrate/Competitorn/a
Meas. Tech.ChEMBL_456499 (CHEMBL887322)
IC50 19±n/a nM
Citation Deur, CAgrawal, AKBaum, HBooth, JBove, SBrieland, JBunker, AConnolly, CCornicelli, JDumin, JFinzel, BGan, XGuppy, SKamilar, GKilgore, KLee, PLoi, CMLou, ZMorris, MPhilippe, LPrzybranowski, SRiley, FSamas, BSanchez, BTecle, HWang, ZWelch, KWilson, MYates, K N-(6,7-dichloro-2,3-dioxo-1,2,3,4-tetrahydroquinoxalin-5-yl)-N-alkylsulfonamides as peripherally restricted N-methyl-D-aspartate receptor antagonists for the treatment of pain. Bioorg Med Chem Lett17:4599-603 (2007) 
 
Glutamate receptor ionotropic, NMDA 1
Name:Glutamate receptor ionotropic, NMDA 1
Type:Enzyme Catalytic Domain
Mol. Mass.:105397.81
Organism:Homo sapiens (Human)
Description:Q05586
Residue:938
BDBM50215285
NameBDBM50215285
Synonyms:CHEMBL400508 | N-(6,7-dichloro-2,3-dioxo-1,2,3,4-tetrahydroquinoxalin-5-yl)-N-(3-ethoxypropyl)methanesulfonamide
TypeSmall organic molecule
Emp. Form.C14H17Cl2N3O5S
Mol. Mass.410.273
SMILESCCOCCCN(c1c(Cl)c(Cl)cc2[nH]c(=O)c(=O)[nH]c12)S(C)(=O)=O