Reaction Details
TargetGlutamate receptor ionotropic, NMDA 1
LigandBDBM50215296
Substrate/Competitorn/a
Meas. Tech.ChEMBL_456499 (CHEMBL887322)
IC50 14±n/a nM
Citation Deur, CAgrawal, AKBaum, HBooth, JBove, SBrieland, JBunker, AConnolly, CCornicelli, JDumin, JFinzel, BGan, XGuppy, SKamilar, GKilgore, KLee, PLoi, CMLou, ZMorris, MPhilippe, LPrzybranowski, SRiley, FSamas, BSanchez, BTecle, HWang, ZWelch, KWilson, MYates, K N-(6,7-dichloro-2,3-dioxo-1,2,3,4-tetrahydroquinoxalin-5-yl)-N-alkylsulfonamides as peripherally restricted N-methyl-D-aspartate receptor antagonists for the treatment of pain. Bioorg Med Chem Lett17:4599-603 (2007) 
 
Glutamate receptor ionotropic, NMDA 1
Name:Glutamate receptor ionotropic, NMDA 1
Type:Enzyme Catalytic Domain
Mol. Mass.:105397.81
Organism:Homo sapiens (Human)
Description:Q05586
Residue:938
BDBM50215296
NameBDBM50215296
Synonyms:CHEMBL401849 | N-(7-chloro-6-methyl-2,3-dioxo-1,2,3,4-tetrahydroquinoxalin-5-yl)-N-(2-hydroxyethyl)methanesulfonamide
TypeSmall organic molecule
Emp. Form.C12H14ClN3O5S
Mol. Mass.347.775
SMILESCc1c(Cl)cc2[nH]c(=O)c(=O)[nH]c2c1N(CCO)S(C)(=O)=O