Reaction Details
TargetP2Y purinoceptor 1
LigandBDBM50121987
Substrate/Competitorn/a
Meas. Tech.ChEMBL_439404 (CHEMBL888517)
IC50 620±n/a nM
Citation Costanzi, STikhonova, IGOhno, MRoh, EJJoshi, BVColson, AOHouston, DMaddileti, SHarden, TKJacobson, KA P2Y1 antagonists: combining receptor-based modeling and QSAR for a quantitative prediction of the biological activity based on consensus scoring. J Med Chem50:3229-41 (2007) 
 
P2Y purinoceptor 1
Name:P2Y purinoceptor 1
Type:Enzyme
Mol. Mass.:42090.25
Organism:Homo sapiens (Human)
Description:P47900
Residue:373
BDBM50121987
NameBDBM50121987
Synonyms:CHEMBL153254 | [3-(2-Chloro-6-methylamino-purin-9-yl)-2-phosphonomethyl-propyl]-phosphonic acid
TypeSmall organic molecule
Emp. Form.C10H16ClN5O6P2
Mol. Mass.399.664
SMILESCNc1nc(Cl)nc2n(CC(CP(O)(O)=O)CP(O)(O)=O)cnc12