Reaction Details
TargetCoagulation factor VII
LigandBDBM50215423
Substrate/Competitorn/a
Meas. Tech.ChEMBL_439443 (CHEMBL888563)
IC50 20±n/a nM
Citation Trujillo, JIHuang, HCNeumann, WLMahoney, MWLong, SHuang, WGarland, DJKusturin, CAbbas, ZSouth, MSReitz, DB Design, synthesis, and biological evaluation of pyrazinones containing novel P1 needles as inhibitors of TF/VIIa. Bioorg Med Chem Lett17:4568-74 (2007) 
 
Coagulation factor VII
Name:Coagulation factor VII
Type:Enzyme
Mol. Mass.:51599.89
Organism:Homo sapiens (Human)
Description:n/a
Residue:466
BDBM50215423
NameBDBM50215423
Synonyms:2-(6-(3-aminophenyl)-5-chloro-3-(cyclobutylamino)-2-oxopyrazin-1(2H)-yl)-N-benzylacetamide | CHEMBL390662
TypeSmall organic molecule
Emp. Form.C23H24ClN5O2
Mol. Mass.437.922
SMILESNc1cccc(c1)-c1c(Cl)nc(NC2CCC2)c(=O)n1CC(=O)NCc1ccccc1