Reaction Details
TargetMAP kinase-activated protein kinase 2
LigandBDBM50215492
Substrate/Competitorn/a
Meas. Tech.ChEMBL_456523 (CHEMBL922889)
IC50 29300±n/a nM
Citation Trujillo, JIMeyers, MJAnderson, DRHegde, SMahoney, MWVernier, WFBuchler, IPWu, KKYang, SYang, SHartmann, SJReitz, DB Novel tetrahydro-beta-carboline-1-carboxylic acids as inhibitors of mitogen activated protein kinase-activated protein kinase 2 (MK-2). Bioorg Med Chem Lett17:4657-63 (2007) 
 
MAP kinase-activated protein kinase 2
Name:MAP kinase-activated protein kinase 2
Type:Serine/threonine-protein kinase
Mol. Mass.:45579.87
Organism:Homo sapiens (Human)
Description:P49137
Residue:400
BDBM50215492
NameBDBM50215492
Synonyms:CHEMBL394125 | ethyl 5-methoxy-9,12-diazatetracyclo[10.2.1.0^{2,10}.0^{3,8}]pentadeca-2(10),3,5,7-tetraene-11-carboxylate
TypeSmall organic molecule
Emp. Form.C17H20N2O3
Mol. Mass.300.3523
SMILESCCOC(=O)C1N2CCC(C2)c2c1[nH]c1ccc(OC)cc21