Reaction Details
TargetMitogen-activated protein kinase 9
LigandBDBM50215483
Substrate/Competitorn/a
Meas. Tech.ChEMBL_456526 (CHEMBL922892)
IC50>200000±n/a nM
Citation Trujillo, JIMeyers, MJAnderson, DRHegde, SMahoney, MWVernier, WFBuchler, IPWu, KKYang, SYang, SHartmann, SJReitz, DB Novel tetrahydro-beta-carboline-1-carboxylic acids as inhibitors of mitogen activated protein kinase-activated protein kinase 2 (MK-2). Bioorg Med Chem Lett17:4657-63 (2007) 
 
Mitogen-activated protein kinase 9
Name:Mitogen-activated protein kinase 9
Type:Enzyme
Mol. Mass.:48131.49
Organism:Homo sapiens (Human)
Description:JNK-2 was purchased from Upstate Cell Signaling Solutions (formerly Upstate Biotechnology).
Residue:424
BDBM50215483
NameBDBM50215483
Synonyms:6-methoxy-2,3,4,9-tetrahydro-1H-pyrido[3,4-b]indole-1-carboxylic acid | CHEMBL395157
TypeSmall organic molecule
Emp. Form.C13H14N2O3
Mol. Mass.246.2619
SMILESCOc1ccc2[nH]c3C(NCCc3c2c1)C(O)=O