Reaction Details
TargetMAP kinase-activated protein kinase 2
LigandBDBM50215521
Substrate/Competitorn/a
Meas. Tech.ChEMBL_456523 (CHEMBL922889)
IC50 130000±n/a nM
Citation Trujillo, JIMeyers, MJAnderson, DRHegde, SMahoney, MWVernier, WFBuchler, IPWu, KKYang, SYang, SHartmann, SJReitz, DB Novel tetrahydro-beta-carboline-1-carboxylic acids as inhibitors of mitogen activated protein kinase-activated protein kinase 2 (MK-2). Bioorg Med Chem Lett17:4657-63 (2007) 
 
MAP kinase-activated protein kinase 2
Name:MAP kinase-activated protein kinase 2
Type:Serine/threonine-protein kinase
Mol. Mass.:45579.87
Organism:Homo sapiens (Human)
Description:P49137
Residue:400
BDBM50215521
NameBDBM50215521
Synonyms:6-methoxy-1-(2H-tetrazol-5-yl)-2,3,4,9-tetrahydro-1H-pyrido[3,4-b]indole | CHEMBL248313
TypeSmall organic molecule
Emp. Form.C13H14N6O
Mol. Mass.270.2899
SMILESCOc1ccc2[nH]c3C(NCCc3c2c1)c1nnn[nH]1