Reaction Details
TargetD(3) dopamine receptor
LigandBDBM50215552
Substrate/Competitorn/a
Meas. Tech.ChEMBL_439685 (CHEMBL888796)
Ki>10000±n/a nM
Citation Siméon, FGBrown, AKZoghbi, SSPatterson, VMInnis, RBPike, VW Synthesis and simple 18F-labeling of 3-fluoro-5-(2-(2-(fluoromethyl)thiazol-4-yl)ethynyl)benzonitrile as a high affinity radioligand for imaging monkey brain metabotropic glutamate subtype-5 receptors with positron emission tomography. J Med Chem50:3256-66 (2007) 
 
D(3) dopamine receptor
Name:D(3) dopamine receptor
Type:n/a
Mol. Mass.:44243.43
Organism:Homo sapiens (Human)
Description:n/a
Residue:400
BDBM50215552
NameBDBM50215552
Synonyms:3-fluoro-5-(2-(2-(fluoromethyl)thiazol-4-yl)ethynyl)benzonitrile | CHEMBL229429
TypeSmall organic molecule
Emp. Form.C13H6F2N2S
Mol. Mass.260.262
SMILESFCc1nc(cs1)C#Cc1cc(F)cc(c1)C#N