Reaction Details
TargetMelanin-concentrating hormone receptor 1
LigandBDBM50215611
Substrate/Competitorn/a
Meas. Tech.ChEMBL_437192 (CHEMBL906590)
Ki 5±n/a nM
Citation Su, JMcKittrick, BATang, HBurnett, DAClader, JWGreenlee, WJHawes, BEO'Neill, KSpar, BWeig, BKowalski, TSorota, SLi, CLiu, T SAR study of bicyclo[4.1.0]heptanes as melanin-concentrating hormone receptor R1 antagonists: taming hERG. Bioorg Med Chem15:5369-85 (2007) 
 
Melanin-concentrating hormone receptor 1
Name:Melanin-concentrating hormone receptor 1
Type:G Protein-Coupled Receptor (GPCR)
Mol. Mass.:45976.27
Organism:Homo sapiens (Human)
Description:Membranes from CHO-K1 cells stably expressing human MCH1R were used in assays.
Residue:422
BDBM50215611
NameBDBM50215611
Synonyms:3-(3-chloro-4-fluorophenyl)-1-((3R,6S)-6-(3-cyanophenyl)bicyclo[4.1.0]heptan-3-yl)-1-(2-(diisopropylamino)ethyl)urea | CHEMBL229715
TypeSmall organic molecule
Emp. Form.C29H36ClFN4O
Mol. Mass.511.074
SMILESCC(C)N(CCN([C@@H]1CC[C@@]2(CC2C1)c1cccc(c1)C#N)C(=O)Nc1ccc(F)c(Cl)c1)C(C)C