Reaction Details
TargetMelanin-concentrating hormone receptor 1
LigandBDBM50215629
Substrate/Competitorn/a
Meas. Tech.ChEMBL_437192 (CHEMBL906590)
Ki 2.7±n/a nM
Citation Su, JMcKittrick, BATang, HBurnett, DAClader, JWGreenlee, WJHawes, BEO'Neill, KSpar, BWeig, BKowalski, TSorota, SLi, CLiu, T SAR study of bicyclo[4.1.0]heptanes as melanin-concentrating hormone receptor R1 antagonists: taming hERG. Bioorg Med Chem15:5369-85 (2007) 
 
Melanin-concentrating hormone receptor 1
Name:Melanin-concentrating hormone receptor 1
Type:G Protein-Coupled Receptor (GPCR)
Mol. Mass.:45976.27
Organism:Homo sapiens (Human)
Description:Membranes from CHO-K1 cells stably expressing human MCH1R were used in assays.
Residue:422
BDBM50215629
NameBDBM50215629
Synonyms:1-((3R,6S)-6-(3-cyanophenyl)bicyclo[4.1.0]heptan-3-yl)-1-(2-(diisopropylamino)ethyl)-3-(3-nitrophenyl)urea | CHEMBL229716
TypeSmall organic molecule
Emp. Form.C29H37N5O3
Mol. Mass.503.6358
SMILESCC(C)N(CCN([C@@H]1CC[C@@]2(CC2C1)c1cccc(c1)C#N)C(=O)Nc1cccc(c1)[N+]([O-])=O)C(C)C