Reaction Details
TargetAndrogen receptor
LigandBDBM18173
Substrate/Competitorn/a
Meas. Tech.ChEMBL_447720 (CHEMBL896728)
Ki 2.11±n/a nM
Citation Manfredi, MCBi, YNirschl, AASutton, JCSeethala, RGolla, RBeehler, BCSleph, PGGrover, GJOstrowski, JHamann, LG Synthesis and SAR of tetrahydropyrrolo[1,2-b][1,2,5]thiadiazol-2(3H)-one 1,1-dioxide analogues as highly potent selective androgen receptor modulators. Bioorg Med Chem Lett17:4487-90 (2007) 
 
Androgen receptor
Name:Androgen receptor
Type:Receptor
Mol. Mass.:99185.27
Organism:Homo sapiens (Human)
Description:CHO cells were stably transfected with human AR gene.
Residue:920
BDBM18173
NameBDBM18173
Synonyms:4-[(7R,7aS)-7-hydroxy-1,3-dioxo-hexahydro-1H-pyrrolo[1,2-a]imidazolidin-2-yl]-2-chloro-3-methylbenzonitrile CHEMBL229264
TypeSmall organic molecule
Emp. Form.C14H12ClN3O3
Mol. Mass.305.716
SMILESCc1c(Cl)c(ccc1-n1c(O)c2[C@H](O)CCn2c1=O)C#N