Reaction Details
TargetAndrogen receptor
LigandBDBM18171
Substrate/Competitorn/a
Meas. Tech.ChEMBL_447721 (CHEMBL896729)
EC50 2.3±n/a nM
Citation Manfredi, MCBi, YNirschl, AASutton, JCSeethala, RGolla, RBeehler, BCSleph, PGGrover, GJOstrowski, JHamann, LG Synthesis and SAR of tetrahydropyrrolo[1,2-b][1,2,5]thiadiazol-2(3H)-one 1,1-dioxide analogues as highly potent selective androgen receptor modulators. Bioorg Med Chem Lett17:4487-90 (2007) 
 
Androgen receptor
Name:Androgen receptor
Type:PROTEIN
Mol. Mass.:98196.62
Organism:Mus musculus
Description:ChEMBL_945930
Residue:899
BDBM18171
NameBDBM18171
Synonyms:4-[(7R,7aS)-7-hydroxy-1,3-dioxo-hexahydro-1H-pyrrolo[1,2-a]imidazolidin-2-yl]naphthalene-1-carbonitrile N-aryl-bicyclic hydantoin, (-)10b | hydantoin, 7
TypeSmall organic molecule
Emp. Form.C17H13N3O3
Mol. Mass.307.3034
SMILESO[C@@H]1CCn2c1c(O)n(-c1ccc(C#N)c3ccccc13)c2=O