Reaction Details
TargetVascular endothelial growth factor receptor 2
LigandBDBM50215747
Substrate/Competitorn/a
Meas. Tech.ChEMBL_456542 (CHEMBL922908)
IC50 1700±n/a nM
Citation Lin, RChiu, GYu, YConnolly, PJLi, SLu, YAdams, MFuentes-Pesquera, AREmanuel, SLGreenberger, LM Design, synthesis, and evaluation of 3,4-disubstituted pyrazole analogues as anti-tumor CDK inhibitors. Bioorg Med Chem Lett17:4557-61 (2007) 
 
Vascular endothelial growth factor receptor 2
Name:Vascular endothelial growth factor receptor 2
Type:Receptor Tyrosine Kinase
Mol. Mass.:151510.97
Organism:Homo sapiens (Human)
Description:P35968
Residue:1356
BDBM50215747
NameBDBM50215747
Synonyms:5-(2-(3-(6-methoxy-1H-benzo[d]imidazol-2-yl)-1H-pyrazol-4-yl)vinyl)nicotinonitrile | CHEMBL395393
TypeSmall organic molecule
Emp. Form.C19H14N6O
Mol. Mass.342.3541
SMILESCOc1ccc2nc([nH]c2c1)-c1n[nH]cc1C=Cc1cncc(c1)C#N