Reaction Details
TargetAurora kinase A
LigandBDBM50215746
Substrate/Competitorn/a
Meas. Tech.ChEMBL_456543 (CHEMBL922909)
IC50 400±n/a nM
Citation Lin, RChiu, GYu, YConnolly, PJLi, SLu, YAdams, MFuentes-Pesquera, AREmanuel, SLGreenberger, LM Design, synthesis, and evaluation of 3,4-disubstituted pyrazole analogues as anti-tumor CDK inhibitors. Bioorg Med Chem Lett17:4557-61 (2007) 
 
Aurora kinase A
Name:Aurora kinase A
Type:Serine/threonine-protein kinase
Mol. Mass.:45830.98
Organism:Homo sapiens (Human)
Description:O14965
Residue:403
BDBM50215746
NameBDBM50215746
Synonyms:6-methoxy-2-(4-(2-(5-methoxypyridin-3-yl)vinyl)-1H-pyrazol-3-yl)-1H-benzo[d]imidazole | CHEMBL245770
TypeSmall organic molecule
Emp. Form.C19H17N5O2
Mol. Mass.347.3706
SMILESCOc1ccc2nc([nH]c2c1)-c1n[nH]cc1C=Cc1cncc(OC)c1