Reaction Details
TargetAurora kinase A
LigandBDBM50215757
Substrate/Competitorn/a
Meas. Tech.ChEMBL_456543 (CHEMBL922909)
IC50 120±n/a nM
Citation Lin, RChiu, GYu, YConnolly, PJLi, SLu, YAdams, MFuentes-Pesquera, AREmanuel, SLGreenberger, LM Design, synthesis, and evaluation of 3,4-disubstituted pyrazole analogues as anti-tumor CDK inhibitors. Bioorg Med Chem Lett17:4557-61 (2007) 
 
Aurora kinase A
Name:Aurora kinase A
Type:Serine/threonine-protein kinase
Mol. Mass.:45830.98
Organism:Homo sapiens (Human)
Description:O14965
Residue:403
BDBM50215757
NameBDBM50215757
Synonyms:3-(2-(3-(4-(trifluoromethyl)-1H-imidazol-2-yl)-1H-pyrazol-4-yl)vinyl)pyridine | CHEMBL246165
TypeSmall organic molecule
Emp. Form.C14H10F3N5
Mol. Mass.305.2579
SMILESFC(F)(F)c1cnc([nH]1)-c1n[nH]cc1C=Cc1cccnc1