Reaction Details
TargetReceptor tyrosine-protein kinase erbB-2
LigandBDBM50215757
Substrate/Competitorn/a
Meas. Tech.ChEMBL_456541 (CHEMBL922907)
IC50>100000±n/a nM
Citation Lin, RChiu, GYu, YConnolly, PJLi, SLu, YAdams, MFuentes-Pesquera, AREmanuel, SLGreenberger, LM Design, synthesis, and evaluation of 3,4-disubstituted pyrazole analogues as anti-tumor CDK inhibitors. Bioorg Med Chem Lett17:4557-61 (2007) 
 
Receptor tyrosine-protein kinase erbB-2
Name:Receptor tyrosine-protein kinase erbB-2
Type:n/a
Mol. Mass.:137894.47
Organism:Homo sapiens (Human)
Description:P04626
Residue:1255
BDBM50215757
NameBDBM50215757
Synonyms:3-(2-(3-(4-(trifluoromethyl)-1H-imidazol-2-yl)-1H-pyrazol-4-yl)vinyl)pyridine | CHEMBL246165
TypeSmall organic molecule
Emp. Form.C14H10F3N5
Mol. Mass.305.2579
SMILESFC(F)(F)c1cnc([nH]1)-c1n[nH]cc1C=Cc1cccnc1