Reaction Details
TargetReceptor tyrosine-protein kinase erbB-2
LigandBDBM50215748
Substrate/Competitorn/a
Meas. Tech.ChEMBL_456541 (CHEMBL922907)
IC50>100000±n/a nM
Citation Lin, RChiu, GYu, YConnolly, PJLi, SLu, YAdams, MFuentes-Pesquera, AREmanuel, SLGreenberger, LM Design, synthesis, and evaluation of 3,4-disubstituted pyrazole analogues as anti-tumor CDK inhibitors. Bioorg Med Chem Lett17:4557-61 (2007) 
 
Receptor tyrosine-protein kinase erbB-2
Name:Receptor tyrosine-protein kinase erbB-2
Type:n/a
Mol. Mass.:137894.47
Organism:Homo sapiens (Human)
Description:P04626
Residue:1255
BDBM50215748
NameBDBM50215748
Synonyms:CHEMBL245376 | N-((5-(2-(3-(4-(trifluoromethyl)-1H-imidazol-2-yl)-1H-pyrazol-4-yl)vinyl)pyridin-3-yl)methyl)ethanamine
TypeSmall organic molecule
Emp. Form.C17H17F3N6
Mol. Mass.362.3523
SMILESCCNCc1cncc(C=Cc2c[nH]nc2-c2ncc([nH]2)C(F)(F)F)c1