Reaction Details
TargetReceptor tyrosine-protein kinase erbB-2
LigandBDBM50215745
Substrate/Competitorn/a
Meas. Tech.ChEMBL_456541 (CHEMBL922907)
IC50 37000±n/a nM
Citation Lin, RChiu, GYu, YConnolly, PJLi, SLu, YAdams, MFuentes-Pesquera, AREmanuel, SLGreenberger, LM Design, synthesis, and evaluation of 3,4-disubstituted pyrazole analogues as anti-tumor CDK inhibitors. Bioorg Med Chem Lett17:4557-61 (2007) 
 
Receptor tyrosine-protein kinase erbB-2
Name:Receptor tyrosine-protein kinase erbB-2
Type:n/a
Mol. Mass.:137894.47
Organism:Homo sapiens (Human)
Description:P04626
Residue:1255
BDBM50215745
NameBDBM50215745
Synonyms:CHEMBL245966 | N-ethyl-5-(2-(3-(6-methoxy-1H-benzo[d]imidazol-2-yl)-1H-pyrazol-4-yl)vinyl)nicotinamide
TypeSmall organic molecule
Emp. Form.C21H20N6O2
Mol. Mass.388.4225
SMILESCCNC(=O)c1cncc(C=Cc2c[nH]nc2-c2nc3ccc(OC)cc3[nH]2)c1