Reaction Details
TargetVascular endothelial growth factor receptor 2
LigandBDBM50215763
Substrate/Competitorn/a
Meas. Tech.ChEMBL_456556 (CHEMBL922924)
IC50 62±n/a nM
Citation Wickens, PKluender, HDixon, JBrennan, CAchebe, FBacchiocchi, ABankston, DBierer, DBrands, MBraun, DBrown, MSChuang, CYDumas, JEnyedy, IHofilena, GHong, ZHousley, TJones, BKhire, UKreiman, CKumarasinghe, ELowinger, TOtt-Morgan, RPerkins, LPhillips, BSchoenleber, RScott, WJSheeler, RRedman, ASun, XTaylor, IWang, LWilhelm, SZhang, XZhang, MSullivan, ECarter, CMiglarese, MLevy, J SAR of a novel 'Anthranilamide Like' series of VEGFR-2, multi protein kinase inhibitors for the treatment of cancer. Bioorg Med Chem Lett17:4378-81 (2007) 
 
Vascular endothelial growth factor receptor 2
Name:Vascular endothelial growth factor receptor 2
Type:Receptor Tyrosine Kinase
Mol. Mass.:151510.97
Organism:Homo sapiens (Human)
Description:P35968
Residue:1356
BDBM50215763
NameBDBM50215763
Synonyms:1-methyl-3-(5-((1-methyl-4-((4-(trifluoromethylthio)phenyl)carbamoyl)-1H-pyrazol-5-ylamino)methyl)pyridin-2-yl)urea | CHEMBL247797
TypeSmall organic molecule
Emp. Form.C20H20F3N7O2S
Mol. Mass.479.479
SMILESCNC(=O)Nc1ccc(CNc2c(cnn2C)C(=O)Nc2ccc(SC(F)(F)F)cc2)cn1