Reaction Details
TargetVascular endothelial growth factor receptor 2
LigandBDBM50215768
Substrate/Competitorn/a
Meas. Tech.ChEMBL_456556 (CHEMBL922924)
IC50 43±n/a nM
Citation Wickens, PKluender, HDixon, JBrennan, CAchebe, FBacchiocchi, ABankston, DBierer, DBrands, MBraun, DBrown, MSChuang, CYDumas, JEnyedy, IHofilena, GHong, ZHousley, TJones, BKhire, UKreiman, CKumarasinghe, ELowinger, TOtt-Morgan, RPerkins, LPhillips, BSchoenleber, RScott, WJSheeler, RRedman, ASun, XTaylor, IWang, LWilhelm, SZhang, XZhang, MSullivan, ECarter, CMiglarese, MLevy, J SAR of a novel 'Anthranilamide Like' series of VEGFR-2, multi protein kinase inhibitors for the treatment of cancer. Bioorg Med Chem Lett17:4378-81 (2007) 
 
Vascular endothelial growth factor receptor 2
Name:Vascular endothelial growth factor receptor 2
Type:Receptor Tyrosine Kinase
Mol. Mass.:151510.97
Organism:Homo sapiens (Human)
Description:P35968
Residue:1356
BDBM50215768
NameBDBM50215768
Synonyms:1-methyl-3-(5-((1-methyl-4-((2,2,3,3-tetrafluoro-2,3-dihydrobenzo[b][1,4]dioxin-6-yl)carbamoyl)-1H-pyrazol-5-ylamino)methyl)pyridin-2-yl)urea | CHEMBL247619
TypeSmall organic molecule
Emp. Form.C21H19F4N7O4
Mol. Mass.509.4137
SMILESCNC(=O)Nc1ccc(CNc2c(cnn2C)C(=O)Nc2ccc3OC(F)(F)C(F)(F)Oc3c2)cn1