Reaction Details
TargetSerine/threonine-protein kinase B-raf
LigandBDBM50215758
Substrate/Competitorn/a
Meas. Tech.ChEMBL_456550 (CHEMBL922916)
IC50 634±n/a nM
Citation Wickens, PKluender, HDixon, JBrennan, CAchebe, FBacchiocchi, ABankston, DBierer, DBrands, MBraun, DBrown, MSChuang, CYDumas, JEnyedy, IHofilena, GHong, ZHousley, TJones, BKhire, UKreiman, CKumarasinghe, ELowinger, TOtt-Morgan, RPerkins, LPhillips, BSchoenleber, RScott, WJSheeler, RRedman, ASun, XTaylor, IWang, LWilhelm, SZhang, XZhang, MSullivan, ECarter, CMiglarese, MLevy, J SAR of a novel 'Anthranilamide Like' series of VEGFR-2, multi protein kinase inhibitors for the treatment of cancer. Bioorg Med Chem Lett17:4378-81 (2007) 
 
Serine/threonine-protein kinase B-raf
Name:Serine/threonine-protein kinase B-raf
Type:Serine/threonine-protein kinase
Mol. Mass.:84446.00
Organism:Homo sapiens (Human)
Description:P15056
Residue:766
BDBM50215758
NameBDBM50215758
Synonyms:2-((2-aminopyridin-4-yl)methylamino)-N-(2,2-difluorobenzo[d][1,3]dioxol-5-yl)benzamide | CHEMBL400109
TypeSmall organic molecule
Emp. Form.C20H16F2N4O3
Mol. Mass.398.3628
SMILESNc1cc(CNc2ccccc2C(=O)Nc2ccc3OC(F)(F)Oc3c2)ccn1